BDBM50421955 CHEMBL1743994
SMILES C(N1CCC2(CCCc3ccccc23)CC1)c1cccs1
InChI Key InChIKey=MTWQZGOUHWNWFQ-UHFFFAOYSA-N
Data  1 IC50
  Tab Delimited (TSV)   2D SDfile   Computed 3D by Vconf -m prep SDfile
Find this compound or compounds like it in BindingDB:
Activity Spreadsheet -- Enzyme Inhibition Constant Data from BindingDB
Found 1 hit for monomerid = 50421955
TargetSigma non-opioid intracellular receptor 1(Homo sapiens (Human))
Merck Sharp And Dohme Research Laboratories
Curated by ChEMBL
LigandPNGBDBM50421955(CHEMBL1743994)
Affinity DataIC50:  6.30nM. Assay description: In vitro binding affinity against sigma receptor by using [3H]-DTG ([3H]-6) as radioligand in guinea pig cerebellum.
In DepthDetails ArticlePubMed